{"text_format":"1","workbook":"xlsx","n_sheets":10,"sheets":["Start","HistoricalData","Assumptions","Mortgage-StyleDetail","Income","CashFlow","Balance","SourcesUses","Ratios","Module1"],"not_rendered":{"charts":0,"images":0,"macros":1,"external_links":0,"defined_names":10,"comments":3,"pivot_tables":0},"unopened":[{"sheet":"Module1","index":9,"reason":"part_missing"}],"bounds":{"document_bytes":16777216,"sheet_cells":100000,"rows_first":2000,"rows_last":500,"rows_between":2000,"halvings":0,"cell_chars":16384,"cell_head_chars":4096},"cells_cut":0,"cells_raw":0,"read":"whole","date_system":"1900"}

{"sheet":"Start","index":0,"n_rows":13,"n_cols":10,"rows_kept":13,"cut":false,"hidden":false,"merged":[[5,2,5,7],[11,2,13,3]]}
[null,null,"TEMPLATE LAST REVISED ON:",null,null,"2021-11-19"]
[]
[]
[]
[null,null,"Enter Project/Company Name"]
[null,null,"Sample Company"]
[]
[null,null," "]
{"$rows_left_out":6}
{"sheet":"HistoricalData","index":1,"n_rows":140,"n_cols":15,"rows_kept":140,"cut":false,"hidden":false,"merged":[]}
[{"$f":"CONCATENATE(Start!C6,\" Historical Financial Statements\")","v":"Sample Company Historical Financial Statements"}]
[null,null,null,null," "]
[null," "]
[null,"Please enter amounts in \"thousands\" of currency units.  ",null,null,null,null,null,null,null,null,null,"Rounding"]
[" ",null,null,null,null,null,null,null,null,null,null,"Thousands"," "]
[null,{"$f":"YEAR(Start!E13)-3","v":2019},{"$f":"B6+1","v":2020},{"$f":"C6+1","v":2021},null,null,null,null,null,null,"Millions"]
["Statement Preparation Type"]
[" "]
{"$rows_left_out":133}
{"sheet":"Assumptions","index":2,"n_rows":181,"n_cols":19,"rows_kept":181,"cut":false,"hidden":false,"merged":[[30,0,30,1],[99,1,99,3],[111,1,111,3],[123,1,123,3],[28,0,28,1],[67,0,67,1]]}
["Calendar Year",null,null,{"$f":"YEAR(Start!E13)","v":2022},{"$f":"D1+1","v":2023},{"$f":"E1+1","v":2024},2025,2026,2027,2028,2029,2030,{"$f":"L1+1","v":2031},{"$f":"M1+1","v":2032},{"$f":"N1+1","v":2033},{"$f":"O1+1","v":2034}]
[" ",null,null,{"$f":"Start!C6","v":"Sample Company"},null,null,null,null,null,null," "]
["Revenues in $000s"]
[]
["Business Line \"A\""]
["Number of Units sold annually",null,null,0,0,0,0,0,0,0,0,0,0,0,0,0,null,"Existing",1]
["Price per Unit (local currency)",null,null,0,0,0,0,0,0,0,0,0,0,0,0,0,null,"New"]
["Currency conversion (local currency per USD)",null,null,1,1,1,{"$f":"$F$8","v":1},{"$f":"$F$8","v":1},1,1,1,1,1,1,1,1]
{"$rows_left_out":174}
{"sheet":"Mortgage-StyleDetail","index":3,"n_rows":182,"n_cols":10,"rows_kept":182,"cut":false,"hidden":true,"merged":[]}
["Assumptions",null,null," ","Payment Date","Year","Mortgage Payment","Interest Portion","Principal Portion","Principal Balance"]
["Disbursement Amount",null,{"$f":"Assumptions!D73","v":0},null,{"$f":"C4","v":"2022-09-15"},{"$f":"YEAR(E2)","v":2022},{"$f":"IF(OR(E2<$C$5,E2>$C$6),0,-PMT($C$8/$C$7,$C$9,$C$2))","v":0},{"$f":"YEARFRAC(C3,E2)*C2*C8","v":0},{"$f":"IF($C$5>E2,0,G2-H2)","v":0},{"$f":"$C$2-I2","v":0}]
["Disbursement Date",null,{"$f":"Assumptions!D82","v":"2022-06-15"},null,{"$f":"IF($C$7=12,EDATE(E2,1),IF($C$7=4,EDATE(E2,3),IF($C$7=2,EDATE(E2,6),0)))","v":"2022-12-15"},{"$f":"YEAR(E3)","v":2022},{"$f":"IF(OR(E3<$C$5,E3>$C$6),0,-PMT($C$8/$C$7,$C$9,$C$2))","v":0},{"$f":"IF(OR(E3<$C$5,E3>$C$6),YEARFRAC(E2,E3)*J2*$C$8,($C$2-SUM($I$1:I2))*($C$8/$C$7))","v":0},{"$f":"IF($C$5>E3,0,G3-H3)","v":0},{"$f":"J2-I3","v":0}]
["First Int Payment Date",null,{"$f":"EDATE(C3,12/C7)","v":"2022-09-15"},null,"2023-03-15",2023,0,{"$f":"IF(OR(E4<$C$5,E4>$C$6),YEARFRAC(E3,E4)*J3*$C$8,($C$2-SUM($I$1:I3))*($C$8/$C$7))","v":0},0,{"$f":"J3-I4","v":0}]
["First Principal Payment Date",null,{"$f":"Assumptions!D83","v":"2023-06-15"},null,"2023-06-15",2023,0,{"$f":"IF(OR(E5<$C$5,E5>$C$6),YEARFRAC(E4,E5)*J4*$C$8,($C$2-SUM($I$1:I4))*($C$8/$C$7))","v":0},0,0]
["Maturity Date",null,{"$f":"Assumptions!D84","v":"2032-06-15"},null,"2023-09-15",2023,0,{"$f":"IF(OR(E6<$C$5,E6>$C$6),YEARFRAC(E5,E6)*J5*$C$8,($C$2-SUM($I$1:I5))*($C$8/$C$7))","v":0},0,0]
["Number of Payments per Year",null,{"$f":"Assumptions!D81","v":4},null,"2023-12-15",2023,0,{"$f":"IF(OR(E7<$C$5,E7>$C$6),YEARFRAC(E6,E7)*J6*$C$8,($C$2-SUM($I$1:I6))*($C$8/$C$7))","v":0},0,0]
["Estimated Annual Interest Rate",null,{"$f":"Assumptions!D76","v":6.5000000000000002E-2},null,"2024-03-15",2024,0,{"$f":"IF(OR(E8<$C$5,E8>$C$6),YEARFRAC(E7,E8)*J7*$C$8,($C$2-SUM($I$1:I7))*($C$8/$C$7))","v":0},0,0]
{"$rows_left_out":175}
{"sheet":"Income","index":4,"n_rows":43,"n_cols":31,"rows_kept":43,"cut":false,"hidden":false,"merged":[[0,11,0,19]]}
[null,null,null,null,null,null,null,null,null,null,null,{"$f":"Start!C6","v":"Sample Company"}]
["Calendar Year",null,null,{"$f":"HistoricalData!D6","v":2021},null,{"$f":"Assumptions!D1","v":2022},null,{"$f":"F2+1","v":2023},null,{"$f":"H2+1","v":2024},null,{"$f":"J2+1","v":2025},null,{"$f":"L2+1","v":2026},null,{"$f":"N2+1","v":2027},null,{"$f":"P2+1","v":2028},null,{"$f":"R2+1","v":2029},null,{"$f":"T2+1","v":2030},null,{"$f":"V2+1","v":2031},null,{"$f":"X2+1","v":2032},null,{"$f":"Z2+1","v":2033},null,{"$f":"AB2+1","v":2034}]
[null,null,null,"Actual",null,"Projected",null,"Projected",null,"Projected",null,"Projected",null,"Projected",null,"Projected",null,"Projected",null,"Projected",null,"Projected",null,"Projected",null,"Projected",null,"Projected",null,"Projected"]
[]
["Revenues",null,null,null,"%",null,"%",null,"%",null,"%",null,"%",null,"%",null,"%",null,"%",null,"%",null,"%",null,"%",null,"%",null,"%",null,"%"]
[{"$f":"Assumptions!A9","v":"Business Line \"A\" Revenue in $000s"},null,null,null,null,{"$f":"Assumptions!D9","v":0},{"$f":"IFERROR(F6/$F$10,\"  \")","v":"  "},{"$f":"Assumptions!E9","v":0},{"$f":"IFERROR(H6/$H$10,\"  \")","v":"  "},{"$f":"Assumptions!F9","v":0},{"$f":"IFERROR(J6/$J$10,\"  \")","v":"  "},{"$f":"Assumptions!G9","v":0},{"$f":"IFERROR(L6/$L$10,\"  \")","v":"  "},{"$f":"Assumptions!H9","v":0},{"$f":"IFERROR(N6/$N$10,\"  \")","v":"  "},{"$f":"Assumptions!I9","v":0},{"$f":"IFERROR(P6/$P$10,\"  \")","v":"  "},{"$f":"Assumptions!J9","v":0},{"$f":"IFERROR(R6/$R$10,\"  \")","v":"  "},{"$f":"Assumptions!K9","v":0},{"$f":"IFERROR(T6/$T$10,\"  \")","v":"  "},{"$f":"Assumptions!L9","v":0},{"$f":"IFERROR(V6/$V$10,\"  \")","v":"  "},{"$f":"Assumptions!M9","v":0},{"$f":"IFERROR(X6/$X$10,\"  \")","v":"  "},{"$f":"Assumptions!N9","v":0},{"$f":"IFERROR(Z6/$Z$10,\"  \")","v":"  "},{"$f":"Assumptions!O9","v":0},{"$f":"IFERROR(AB6/$AB$10,\"  \")","v":"  "},{"$f":"Assumptions!P9","v":0},{"$f":"IFERROR(AD6/$AD$10,\"  \")","v":"  "}]
[{"$f":"Assumptions!A15","v":"Business Line \"B\" Revenue in $000s"},null,null,null,null,{"$f":"Assumptions!D15","v":0},{"$f":"IFERROR(F7/$F$10,\"  \")","v":"  "},{"$f":"Assumptions!E15","v":0},{"$f":"IFERROR(H7/$H$10,\"  \")","v":"  "},{"$f":"Assumptions!F15","v":0},{"$f":"IFERROR(J7/$J$10,\"  \")","v":"  "},{"$f":"Assumptions!G15","v":0},{"$f":"IFERROR(L7/$L$10,\"  \")","v":"  "},{"$f":"Assumptions!H15","v":0},{"$f":"IFERROR(N7/$N$10,\"  \")","v":"  "},{"$f":"Assumptions!I15","v":0},{"$f":"IFERROR(P7/$P$10,\"  \")","v":"  "},{"$f":"Assumptions!J15","v":0},{"$f":"IFERROR(R7/$R$10,\"  \")","v":"  "},{"$f":"Assumptions!K15","v":0},{"$f":"IFERROR(T7/$T$10,\"  \")","v":"  "},{"$f":"Assumptions!L15","v":0},{"$f":"IFERROR(V7/$V$10,\"  \")","v":"  "},{"$f":"Assumptions!M15","v":0},{"$f":"IFERROR(X7/$X$10,\"  \")","v":"  "},{"$f":"Assumptions!N15","v":0},{"$f":"IFERROR(Z7/$Z$10,\"  \")","v":"  "},{"$f":"Assumptions!O15","v":0},{"$f":"IFERROR(AB7/$AB$10,\"  \")","v":"  "},{"$f":"Assumptions!P15","v":0},{"$f":"IFERROR(AD7/$AD$10,\"  \")","v":"  "}]
[{"$f":"Assumptions!A21","v":"Business Line \"C\" Revenue in $000s"},null,null,null,null,{"$f":"Assumptions!D21","v":0},{"$f":"IFERROR(F8/$F$10,\"  \")","v":"  "},{"$f":"Assumptions!E21","v":0},{"$f":"IFERROR(H8/$H$10,\"  \")","v":"  "},{"$f":"Assumptions!F21","v":0},{"$f":"IFERROR(J8/$J$10,\"  \")","v":"  "},{"$f":"Assumptions!G21","v":0},{"$f":"IFERROR(L8/$L$10,\"  \")","v":"  "},{"$f":"Assumptions!H21","v":0},{"$f":"IFERROR(N8/$N$10,\"  \")","v":"  "},{"$f":"Assumptions!I21","v":0},{"$f":"IFERROR(P8/$P$10,\"  \")","v":"  "},{"$f":"Assumptions!J21","v":0},{"$f":"IFERROR(R8/$R$10,\"  \")","v":"  "},{"$f":"Assumptions!K21","v":0},{"$f":"IFERROR(T8/$T$10,\"  \")","v":"  "},{"$f":"Assumptions!L21","v":0},{"$f":"IFERROR(V8/$V$10,\"  \")","v":"  "},{"$f":"Assumptions!M21","v":0},{"$f":"IFERROR(X8/$X$10,\"  \")","v":"  "},{"$f":"Assumptions!N21","v":0},{"$f":"IFERROR(Z8/$Z$10,\"  \")","v":"  "},{"$f":"Assumptions!O21","v":0},{"$f":"IFERROR(AB8/$AB$10,\"  \")","v":"  "},{"$f":"Assumptions!P21","v":0},{"$f":"IFERROR(AD8/$AD$10,\"  \")","v":"  "}]
{"$rows_left_out":36}
{"sheet":"CashFlow","index":5,"n_rows":102,"n_cols":17,"rows_kept":102,"cut":false,"hidden":false,"merged":[[0,7,0,11],[44,7,44,11]]}
[null,null,null,null,null,null,null,{"$f":"Start!C6","v":"Sample Company"}]
["Calendar Year",null,null,{"$f":"HistoricalData!D6","v":2021},{"$f":"Assumptions!D1","v":2022},{"$f":"E2+1","v":2023},2024,2025,2026,2027,2028,2029,{"$f":"L2+1","v":2030},{"$f":"M2+1","v":2031},{"$f":"N2+1","v":2032},{"$f":"O2+1","v":2033},{"$f":"P2+1","v":2034}]
[null,null,null,"Actual","Projected","Projected","Projected","Projected","Projected","Projected","Projected","Projected","Projected","Projected","Projected","Projected","Projected"]
["Cash Flow Statement"]
["Sales",null,null,{"$f":"Income!D10","v":0},{"$f":"Income!F10","v":0},{"$f":"Income!H10","v":0},{"$f":"Income!J10","v":0},{"$f":"Income!L10","v":0},{"$f":"Income!N10","v":0},{"$f":"Income!P10","v":0},{"$f":"Income!R10","v":0},{"$f":"Income!T10","v":0},{"$f":"Income!V10","v":0},{"$f":"Income!X10","v":0},{"$f":"Income!Z10","v":0},{"$f":"Income!AB10","v":0},{"$f":"Income!AD10","v":0}]
["Change in Receivables",null,null,{"$f":"-IF(ISBLANK(HistoricalData!$D$10)=TRUE,SUM(HistoricalData!D15:D16)-SUM(HistoricalData!C15:C16),SUM(HistoricalData!D78:D79)-SUM(HistoricalData!C78:C79)-(SUM(HistoricalData!C15:C16)/HistoricalData!D10-SUM(HistoricalData!C15:C16)/HistoricalData!C10))","v":0},{"$f":"-(Balance!E9-Balance!D9)","v":0},{"$f":"-(Balance!F9-Balance!E9)","v":0},{"$f":"-(Balance!G9-Balance!F9)","v":0},{"$f":"-(Balance!H9-Balance!G9)","v":0},{"$f":"-(Balance!I9-Balance!H9)","v":0},{"$f":"-(Balance!J9-Balance!I9)","v":0},{"$f":"-(Balance!K9-Balance!J9)","v":0},{"$f":"-(Balance!L9-Balance!K9)","v":0},{"$f":"-(Balance!M9-Balance!L9)","v":0},{"$f":"-(Balance!N9-Balance!M9)","v":0},{"$f":"-(Balance!O9-Balance!N9)","v":0},{"$f":"-(Balance!P9-Balance!O9)","v":0},{"$f":"-(Balance!Q9-Balance!P9)","v":0}]
["Cash from Sales",null,null,{"$f":"D5+D6","v":0},0,0,0,0,0,0,0,0,0,{"$f":"N5+N6","v":0},{"$f":"O5+O6","v":0},{"$f":"P5+P6","v":0},{"$f":"Q5+Q6","v":0}]
[]
{"$rows_left_out":95}
{"sheet":"Balance","index":6,"n_rows":55,"n_cols":17,"rows_kept":55,"cut":false,"hidden":false,"merged":[[0,7,0,11]]}
[null,null,null,null,null,null,null,{"$f":"Start!C6","v":"Sample Company"}]
["Calendar Year",null,null,{"$f":"HistoricalData!D6","v":2021},{"$f":"Assumptions!D1","v":2022},{"$f":"E2+1","v":2023},2024,2025,2026,2027,2028,2029,{"$f":"L2+1","v":2030},{"$f":"M2+1","v":2031},{"$f":"N2+1","v":2032},{"$f":"O2+1","v":2033},{"$f":"P2+1","v":2034}]
[null,null,null,"Actual","Projected","Projected","Projected","Projected","Projected","Projected","Projected","Projected","Projected","Projected","Projected","Projected","Projected"]
["Assets",null,null,null,{"$f":"IF(OR(E7<0,F7<0,G7<0,H7<0,I7<0,J7<0,K7<0,L7<0,M7<0,N7<0,O7<0,P7<0,Q7<0),\"WARNING:  CASH BALANCE IS NEGATIVE IN ONE OR MORE PERIODS\",\"   \")","v":"   "}]
[]
["Current Assets"]
["Cash",null,null,{"$f":"CashFlow!D42","v":0},{"$f":"CashFlow!E42","v":0},{"$f":"CashFlow!F42","v":0},{"$f":"CashFlow!G42","v":0},{"$f":"CashFlow!H42","v":0},{"$f":"CashFlow!I42","v":0},{"$f":"CashFlow!J42","v":0},{"$f":"CashFlow!K42","v":0},{"$f":"CashFlow!L42","v":0},{"$f":"CashFlow!M42","v":0},{"$f":"CashFlow!N42","v":0},{"$f":"CashFlow!O42","v":0},{"$f":"CashFlow!P42","v":0},{"$f":"CashFlow!Q42","v":0}]
["Debt Service Reserve/Restricted Cash",null,null,null,{"$f":"-CashFlow!E41","v":0},{"$f":"E8-CashFlow!F41","v":0},{"$f":"F8-CashFlow!G41","v":0},{"$f":"G8-CashFlow!H41","v":0},{"$f":"H8-CashFlow!I41","v":0},{"$f":"I8-CashFlow!J41","v":0},{"$f":"J8-CashFlow!K41","v":0},{"$f":"K8-CashFlow!L41","v":0},{"$f":"L8-CashFlow!M41","v":0},{"$f":"M8-CashFlow!N41","v":0},{"$f":"N8-CashFlow!O41","v":0},{"$f":"O8-CashFlow!P41","v":0},{"$f":"P8-CashFlow!Q41","v":0}]
{"$rows_left_out":48}
{"sheet":"SourcesUses","index":7,"n_rows":31,"n_cols":16,"rows_kept":31,"cut":false,"hidden":false,"merged":[[0,6,0,10]]}
[null,null,null,null,null,null,{"$f":"Start!C6","v":"Sample Company"}]
["Calendar Year",null,null,{"$f":"Assumptions!D1","v":2022},{"$f":"D2+1","v":2023},2024,2025,2026,2027,2028,2029,2030,2031,2032,{"$f":"N2+1","v":2033},{"$f":"O2+1","v":2034}]
[null,null,null,"Projected","Projected","Projected","Projected","Projected","Projected","Projected","Projected","Projected","Projected","Projected","Projected","Projected"]
[]
["Uses of Funds"]
[]
[{"$f":"Assumptions!A58","v":"Expense Line Item 1"},null,null,{"$f":"Assumptions!D58","v":0},{"$f":"Assumptions!E58","v":0},{"$f":"Assumptions!F58","v":0},{"$f":"Assumptions!G58","v":0},{"$f":"Assumptions!H58","v":0},{"$f":"Assumptions!I58","v":0},{"$f":"Assumptions!J58","v":0},{"$f":"Assumptions!K58","v":0},{"$f":"Assumptions!L58","v":0},{"$f":"Assumptions!M58","v":0},{"$f":"Assumptions!N58","v":0},{"$f":"Assumptions!O58","v":0},{"$f":"Assumptions!P58","v":0}]
[{"$f":"Assumptions!A59","v":"Expense Line Item 2"},null,null,{"$f":"Assumptions!D59","v":0},{"$f":"Assumptions!E59","v":0},{"$f":"Assumptions!F59","v":0},{"$f":"Assumptions!G59","v":0},{"$f":"Assumptions!H59","v":0},{"$f":"Assumptions!I59","v":0},{"$f":"Assumptions!J59","v":0},{"$f":"Assumptions!K59","v":0},{"$f":"Assumptions!L59","v":0},{"$f":"Assumptions!M59","v":0},{"$f":"Assumptions!N59","v":0},{"$f":"Assumptions!O59","v":0},{"$f":"Assumptions!P59","v":0}]
{"$rows_left_out":24}
{"sheet":"Ratios","index":8,"n_rows":29,"n_cols":17,"rows_kept":29,"cut":false,"hidden":false,"merged":[[0,7,0,11]]}
[null,null,null,null,null,null,null,{"$f":"Start!C6","v":"Sample Company"}]
["Calendar Year",null,null,{"$f":"HistoricalData!D6","v":2021},{"$f":"Assumptions!D1","v":2022},{"$f":"E2+1","v":2023},2024,2025,2026,2027,2028,2029,{"$f":"L2+1","v":2030},{"$f":"M2+1","v":2031},{"$f":"N2+1","v":2032},{"$f":"O2+1","v":2033},{"$f":"P2+1","v":2034}]
[null,null,null,"Actual","Projected","Projected","Projected","Projected","Projected","Projected","Projected","Projected","Projected","Projected","Projected","Projected","Projected"]
["Liquidity Ratios"]
["Quick Ratio",null,null,{"$f":"IF(ISERROR((Balance!D13-Balance!D10)/Balance!D39),\"  \",(Balance!D13-Balance!D10)/Balance!D39)","v":"  "},{"$f":"IF(ISERROR((Balance!E13-Balance!E10)/Balance!E39),\"  \",(Balance!E13-Balance!E10)/Balance!E39)","v":"  "},{"$f":"IF(ISERROR((Balance!F13-Balance!F10)/Balance!F39),\"  \",(Balance!F13-Balance!F10)/Balance!F39)","v":"  "},{"$f":"IF(ISERROR((Balance!G13-Balance!G10)/Balance!G39),\"  \",(Balance!G13-Balance!G10)/Balance!G39)","v":"  "},{"$f":"IF(ISERROR((Balance!H13-Balance!H10)/Balance!H39),\"  \",(Balance!H13-Balance!H10)/Balance!H39)","v":"  "},{"$f":"IF(ISERROR((Balance!I13-Balance!I10)/Balance!I39),\"  \",(Balance!I13-Balance!I10)/Balance!I39)","v":"  "},{"$f":"IF(ISERROR((Balance!J13-Balance!J10)/Balance!J39),\"  \",(Balance!J13-Balance!J10)/Balance!J39)","v":"  "},{"$f":"IF(ISERROR((Balance!K13-Balance!K10)/Balance!K39),\"  \",(Balance!K13-Balance!K10)/Balance!K39)","v":"  "},{"$f":"IF(ISERROR((Balance!L13-Balance!L10)/Balance!L39),\"  \",(Balance!L13-Balance!L10)/Balance!L39)","v":"  "},{"$f":"IF(ISERROR((Balance!M13-Balance!M10)/Balance!M39),\"  \",(Balance!M13-Balance!M10)/Balance!M39)","v":"  "},{"$f":"IF(ISERROR((Balance!N13-Balance!N10)/Balance!N39),\"  \",(Balance!N13-Balance!N10)/Balance!N39)","v":"  "},{"$f":"IF(ISERROR((Balance!O13-Balance!O10)/Balance!O39),\"  \",(Balance!O13-Balance!O10)/Balance!O39)","v":"  "},{"$f":"IF(ISERROR((Balance!P13-Balance!P10)/Balance!P39),\"  \",(Balance!P13-Balance!P10)/Balance!P39)","v":"  "},{"$f":"IF(ISERROR((Balance!Q13-Balance!Q10)/Balance!Q39),\"  \",(Balance!Q13-Balance!Q10)/Balance!Q39)","v":"  "}]
["Current Ratio",null,null,{"$f":"IF(ISERROR(Balance!D13/Balance!D39),\"  \",Balance!D13/Balance!D39)","v":"  "},{"$f":"IF(ISERROR(Balance!E13/Balance!E39),\"  \",Balance!E13/Balance!E39)","v":"  "},{"$f":"IF(ISERROR(Balance!F13/Balance!F39),\"  \",Balance!F13/Balance!F39)","v":"  "},{"$f":"IF(ISERROR(Balance!G13/Balance!G39),\"  \",Balance!G13/Balance!G39)","v":"  "},{"$f":"IF(ISERROR(Balance!H13/Balance!H39),\"  \",Balance!H13/Balance!H39)","v":"  "},{"$f":"IF(ISERROR(Balance!I13/Balance!I39),\"  \",Balance!I13/Balance!I39)","v":"  "},{"$f":"IF(ISERROR(Balance!J13/Balance!J39),\"  \",Balance!J13/Balance!J39)","v":"  "},{"$f":"IF(ISERROR(Balance!K13/Balance!K39),\"  \",Balance!K13/Balance!K39)","v":"  "},{"$f":"IF(ISERROR(Balance!L13/Balance!L39),\"  \",Balance!L13/Balance!L39)","v":"  "},{"$f":"IF(ISERROR(Balance!M13/Balance!M39),\"  \",Balance!M13/Balance!M39)","v":"  "},{"$f":"IF(ISERROR(Balance!N13/Balance!N39),\"  \",Balance!N13/Balance!N39)","v":"  "},{"$f":"IF(ISERROR(Balance!O13/Balance!O39),\"  \",Balance!O13/Balance!O39)","v":"  "},{"$f":"IF(ISERROR(Balance!P13/Balance!P39),\"  \",Balance!P13/Balance!P39)","v":"  "},{"$f":"IF(ISERROR(Balance!Q13/Balance!Q39),\"  \",Balance!Q13/Balance!Q39)","v":"  "}]
[]
["Leverage Ratios"]
{"$rows_left_out":21}